scintillation-n
type: LexicalEntry
canonical form: scintillation
sense: 04778367-n
part of speech: noun

04778367-n
type: LexicalConcept
in scheme: en-word.net
definition: the twinkling of the stars caused when changes in the density of the earth's atmosphere produce uneven refraction of starlight
ili: i62084
lexfile: noun.attribute
part of speech: noun
hypernym: 04778150-n