totality-n
type: LexicalEntry
canonical form: totality
sense: 04773106-n
part of speech: noun

04773106-n
type: LexicalConcept
in scheme: en-word.net
definition: the quality of being complete and indiscriminate
example: the totality of war and its consequences
example: the all-embracing totality of the state
ili: i62059
lexfile: noun.attribute
part of speech: noun
hypernym: 04771667-n