probability-n
type: LexicalEntry
canonical form: probability
sense: 04763427-n
part of speech: noun

04763427-n
type: LexicalConcept
in scheme: en-word.net
definition: the quality of being probable; a probable event or the most probable event
example: for a while mutiny seemed a probability
example: going by past experience, there was a high probability that the visitors were lost
ili: i62018
lexfile: noun.attribute
part of speech: noun
hypernym: 04731092-n