inconsistency-n
type: LexicalEntry
canonical form: inconsistency
sense: 04759102-n
part of speech: noun

04759102-n
type: LexicalConcept
in scheme: en-word.net
definition: the quality of being inconsistent and lacking a harmonious uniformity among things or parts
ili: i61996
lexfile: noun.attribute
part of speech: noun
hypernym: 04758195-n