echo-n
type: LexicalEntry
canonical form: echo
sense: 04753847-n
part of speech: noun

04753847-n
type: LexicalConcept
in scheme: en-word.net
definition: a close parallel of a feeling, idea, style, etc.
example: his contention contains more than an echo of Rousseau
example: Napoleon III was an echo of the mighty Emperor but an infinitely better man
ili: i61968
lexfile: noun.attribute
part of speech: noun
hypernym: 04753670-n