publicity-n
type: LexicalEntry
canonical form: publicity
sense: 04727812-n
part of speech: noun

04727812-n
type: LexicalConcept
in scheme: en-word.net
definition: the quality of being open to public view
example: the publicity of the court room
ili: i61855
lexfile: noun.attribute
part of speech: noun
hypernym: 04731092-n