incompatibility-n
type: LexicalEntry
canonical form: incompatibility
sense: 04721716-n
part of speech: noun

04721716-n
type: LexicalConcept
in scheme: en-word.net
definition: the quality of being unable to exist or work in congenial combination
ili: i61827
lexfile: noun.attribute
part of speech: noun
hypernym: 04738737-n