fascination-n
type: LexicalEntry
canonical form: fascination
sense: 04696799-n
part of speech: noun

04696799-n
type: LexicalConcept
in scheme: en-word.net
definition: the capacity to attract intense interest
example: he held the children spellbound with magic tricks and other fascinations
ili: i61696
lexfile: noun.attribute
part of speech: noun
hypernym: 04695595-n