worn spot-n
type: LexicalEntry
canonical form: worn spot
sense: 04690359-n
part of speech: noun

fret-n
type: LexicalEntry
canonical form: fret
sense: 04690359-n
part of speech: noun

04690359-n
type: LexicalConcept
in scheme: en-word.net
definition: a spot that has been worn away by abrasion or erosion
ili: i61662
lexfile: noun.attribute
part of speech: noun
hypernym: 04689819-n