color-n
type: LexicalEntry
canonical form: color
sense: 04682325-n
part of speech: noun

colour-n
type: LexicalEntry
canonical form: colour
sense: 04682325-n
part of speech: noun

04682325-n
type: LexicalConcept
in scheme: en-word.net
definition: the appearance of objects (or light sources) described in terms of a person's perception of their hue and lightness (or brightness) and saturation
ili: i61623
lexfile: noun.attribute
part of speech: noun
hypernym: 04681322-n