strictness-n
type: LexicalEntry
canonical form: strictness
sense: 04680530-n
part of speech: noun

stringency-n
type: LexicalEntry
canonical form: stringency
sense: 04680530-n
part of speech: noun

04680530-n
type: LexicalConcept
in scheme: en-word.net
definition: conscientious attention to rules and details
ili: i61615
lexfile: noun.attribute
part of speech: noun
hypernym: 04679712-n