solidity-n
type: LexicalEntry
canonical form: solidity
sense: 04678432-n
part of speech: noun

solidness-n
type: LexicalEntry
canonical form: solidness
sense: 04678432-n
part of speech: noun

04678432-n
type: LexicalConcept
in scheme: en-word.net
definition: the quality of being solid and reliable financially or factually or morally
example: the solidity of the evidence worked in his favor
example: the solidness of her faith gave her enduring hope
ili: i61607
lexfile: noun.attribute
part of speech: noun
hypernym: 04677379-n