responsibility-n
type: LexicalEntry
canonical form: responsibility
sense: 04676604-n
part of speech: noun

responsibleness-n
type: LexicalEntry
canonical form: responsibleness
sense: 04676604-n
part of speech: noun

04676604-n
type: LexicalConcept
in scheme: en-word.net
definition: a form of trustworthiness; the trait of being answerable to someone for something or being responsible for one's conduct
example: he holds a position of great responsibility
ili: i61601
lexfile: noun.attribute
part of speech: noun
attribute: https://en-word.net/synset/02003477-a
attribute: https://en-word.net/synset/02005010-a
hypernym: 04676176-n