closeness-n
type: LexicalEntry
canonical form: closeness
sense: 04664764-n
part of speech: noun

secretiveness-n
type: LexicalEntry
canonical form: secretiveness
sense: 04664764-n
part of speech: noun

04664764-n
type: LexicalConcept
in scheme: en-word.net
definition: characterized by a lack of openness (especially about one's actions or purposes)
ili: i61540
lexfile: noun.attribute
part of speech: noun
hypernym: 04664105-n