softness-n
type: LexicalEntry
canonical form: softness
sense: 04646214-n
part of speech: noun

04646214-n
type: LexicalConcept
in scheme: en-word.net
definition: a disposition to be lenient in judging others
example: softness is not something permitted of good leaders
ili: i61451
lexfile: noun.attribute
part of speech: noun
hypernym: 04645942-n