drama-n
type: LexicalEntry
canonical form: drama
sense: 04634062-n
part of speech: noun

04634062-n
type: LexicalConcept
in scheme: en-word.net
definition: the quality of being arresting or highly emotional
ili: i61388
lexfile: noun.attribute
part of speech: noun
attribute: https://en-word.net/synset/00798380-a
attribute: https://en-word.net/synset/00799050-a
hypernym: 04633637-n