yawl-n
type: LexicalEntry
canonical form: yawl
sense: 04619861-n
part of speech: noun

04619861-n
type: LexicalConcept
in scheme: en-word.net
definition: a ship's small boat (usually rowed by 4 or 6 oars)
ili: i61320
lexfile: noun.artifact
part of speech: noun
hypernym: 04252125-n