work-n
type: LexicalEntry
canonical form: work
sense: 04606723-n
part of speech: noun

piece of work-n
type: LexicalEntry
canonical form: piece of work
sense: 04606723-n
part of speech: noun

04606723-n
type: LexicalConcept
in scheme: en-word.net
definition: a product produced or accomplished through the effort or activity or agency of a person or thing
example: it is not regarded as one of his more memorable works
example: the symphony was hailed as an ingenious work
example: he was indebted to the pioneering work of John Dewey
example: the work of an active imagination
example: erosion is the work of wind or water over time
ili: i61245
lexfile: noun.artifact
part of speech: noun
hypernym: 04014270-n