web-n
type: LexicalEntry
canonical form: web
sense: 04575843-n
part of speech: noun

entanglement-n
type: LexicalEntry
canonical form: entanglement
sense: 04575843-n
part of speech: noun

04575843-n
type: LexicalConcept
in scheme: en-word.net
definition: an intricate trap that entangles or ensnares its victim
ili: i61052
lexfile: noun.artifact
part of speech: noun
hypernym: 04481701-n