upper-n
type: LexicalEntry
canonical form: upper
sense: 04521654-n
part of speech: noun

04521654-n
type: LexicalConcept
in scheme: en-word.net
definition: piece of leather or synthetic material that forms the part of a shoe or boot above the sole that encases the foot
example: Uppers come in many styles
ili: i60738
lexfile: noun.artifact
part of speech: noun
hypernym: 03939459-n
mero part: 04038076-n
mero part: 04527315-n