tube-n
type: LexicalEntry
canonical form: tube
sense: 04500800-n
part of speech: noun

tubing-n
type: LexicalEntry
canonical form: tubing
sense: 04500800-n
part of speech: noun

04500800-n
type: LexicalConcept
in scheme: en-word.net
definition: conduit consisting of a long hollow object (usually cylindrical) used to hold and conduct objects or liquids or gases
ili: i60614
lexfile: noun.artifact
part of speech: noun
hypernym: 03093470-n