trump-n
type: LexicalEntry
canonical form: trump
sense: 04498430-n
part of speech: noun

trump card-n
type: LexicalEntry
canonical form: trump card
sense: 04498430-n
part of speech: noun

04498430-n
type: LexicalConcept
in scheme: en-word.net
definition: a playing card in the suit that has been declared trumps
example: the ace of trumps is a sure winner
ili: i60597
lexfile: noun.artifact
part of speech: noun
hypernym: 03970276-n