trigger-n
type: LexicalEntry
canonical form: trigger
sense: 04490329-n
part of speech: noun

04490329-n
type: LexicalConcept
in scheme: en-word.net
definition: a device that activates or releases or causes something to happen
ili: i60550
lexfile: noun.artifact
part of speech: noun
hypernym: 03187746-n