trap-n
type: LexicalEntry
canonical form: trap
sense: 04482157-n
part of speech: noun

04482157-n
type: LexicalConcept
in scheme: en-word.net
definition: a device to hurl clay pigeons into the air for trapshooters
ili: i60493
lexfile: noun.artifact
part of speech: noun
hypernym: 03742461-n