trammel-n
type: LexicalEntry
canonical form: trammel
sense: 04476382-n
part of speech: noun

04476382-n
type: LexicalConcept
in scheme: en-word.net
definition: a restraint that is used to teach a horse to amble
ili: i60464
lexfile: noun.artifact
part of speech: noun
hypernym: 04088956-n