train-n
type: LexicalEntry
canonical form: train
sense: 04475240-n
part of speech: noun

railroad train-n
type: LexicalEntry
canonical form: railroad train
sense: 04475240-n
part of speech: noun

04475240-n
type: LexicalConcept
in scheme: en-word.net
definition: public transport provided by a line of railway cars coupled together and drawn by a locomotive
example: express trains don't stop at Princeton Junction
ili: i60459
lexfile: noun.artifact
part of speech: noun
hypernym: 04025495-n
mero member: 02963378-n
mero member: 03690149-n