toilet bowl-n
type: LexicalEntry
canonical form: toilet bowl
sense: 04454162-n
part of speech: noun

04454162-n
type: LexicalConcept
in scheme: en-word.net
definition: the bowl of a toilet that can be flushed with water
ili: i60336
lexfile: noun.artifact
part of speech: noun
domain topic: 00845915-n
domain topic: 14878134-n
exemplifies: 06730109-n
hypernym: 02884435-n