telescope-n
type: LexicalEntry
canonical form: telescope
sense: 04410773-n
part of speech: noun

scope-n
type: LexicalEntry
canonical form: scope
sense: 04410773-n
part of speech: noun

04410773-n
type: LexicalConcept
in scheme: en-word.net
definition: a magnifier of images of distant objects
ili: i60080
lexfile: noun.artifact
part of speech: noun
hypernym: 03714745-n
mero part: 02730066-n
mero part: 03345668-n
mero part: 04011716-n