tail-n
type: LexicalEntry
canonical form: tail
sense: 04391286-n
part of speech: noun

04391286-n
type: LexicalConcept
in scheme: en-word.net
definition: (usually plural) the reverse side of a coin that does not bear the representation of a person's head
ili: i59953
lexfile: noun.artifact
part of speech: noun
exemplifies: 06306016-n
hypernym: 04092293-n