switch-n
type: LexicalEntry
canonical form: switch
sense: 04379843-n
part of speech: noun

04379843-n
type: LexicalConcept
in scheme: en-word.net
definition: railroad track having two movable rails and necessary connections; used to turn a train from one track to another or to store rolling stock
ili: i59888
lexfile: noun.artifact
part of speech: noun
hypernym: 04055187-n