surface-n
type: LexicalEntry
canonical form: surface
sense: 04369112-n
part of speech: noun

04369112-n
type: LexicalConcept
in scheme: en-word.net
definition: the outer boundary of an artifact or a material layer constituting or resembling such a boundary
example: there is a special cleaner for these surfaces
example: the cloth had a pattern of red dots on a white surface
ili: i59827
lexfile: noun.artifact
part of speech: noun
hypernym: 00022119-n