support-n
type: LexicalEntry
canonical form: support
sense: 04366676-n
part of speech: noun

04366676-n
type: LexicalConcept
in scheme: en-word.net
definition: any device that bears the weight of another thing
example: there was no place to attach supports for a shelf
ili: i59816
lexfile: noun.artifact
part of speech: noun
hypernym: 03187746-n