stuffing-n
type: LexicalEntry
canonical form: stuffing
sense: 04352536-n
part of speech: noun

04352536-n
type: LexicalConcept
in scheme: en-word.net
definition: padding put in mattresses and cushions and upholstered furniture
ili: i59723
lexfile: noun.artifact
part of speech: noun
hypernym: 03878742-n