strap-n
type: LexicalEntry
canonical form: strap
sense: 04340847-n
part of speech: noun

04340847-n
type: LexicalConcept
in scheme: en-word.net
definition: hanger consisting of a loop of leather suspended from the ceiling of a bus or train; passengers hold onto it
ili: i59665
lexfile: noun.artifact
part of speech: noun
hypernym: 03495985-n