step-n
type: LexicalEntry
canonical form: step
sense: 04322052-n
part of speech: noun

stair-n
type: LexicalEntry
canonical form: stair
sense: 04322052-n
part of speech: noun

04322052-n
type: LexicalConcept
in scheme: en-word.net
definition: support consisting of a place to rest the foot while ascending or descending a stairway
example: he paused on the bottom step
ili: i59555
lexfile: noun.artifact
part of speech: noun
hypernym: 04366676-n
mero part: 04101814-n
mero part: 04484066-n