steel-n
type: LexicalEntry
canonical form: steel
sense: 04318042-n
part of speech: noun

04318042-n
type: LexicalConcept
in scheme: en-word.net
definition: knife sharpener consisting of a ridged steel rod
ili: i59529
lexfile: noun.artifact
part of speech: noun
hypernym: 04192114-n