steamer-n
type: LexicalEntry
canonical form: steamer
sense: 04316686-n
part of speech: noun

04316686-n
type: LexicalConcept
in scheme: en-word.net
definition: a cooking utensil that can be used to cook food by steaming it
ili: i59519
lexfile: noun.artifact
part of speech: noun
hypernym: 03106637-n