stay-n
type: LexicalEntry
canonical form: stay
sense: 04314557-n
part of speech: noun

04314557-n
type: LexicalConcept
in scheme: en-word.net
definition: (nautical) brace consisting of a heavy rope or wire cable used as a support for a mast or spar
ili: i59506
lexfile: noun.artifact
part of speech: noun
domain topic: 00315295-n
hypernym: 02889840-n