stagecoach-n
type: LexicalEntry
canonical form: stagecoach
sense: 04304236-n
part of speech: noun

stage-n
type: LexicalEntry
canonical form: stage
sense: 04304236-n
part of speech: noun

04304236-n
type: LexicalConcept
in scheme: en-word.net
definition: a large coach-and-four formerly used to carry passengers and mail on regular routes between towns
example: we went out of town together by stage about ten or twelve miles
ili: i59441
lexfile: noun.artifact
part of speech: noun
hypernym: 03059655-n