stage-n
type: LexicalEntry
canonical form: stage
sense: 04304087-n
part of speech: noun

microscope stage-n
type: LexicalEntry
canonical form: microscope stage
sense: 04304087-n
part of speech: noun

04304087-n
type: LexicalConcept
in scheme: en-word.net
definition: a small platform on a microscope where the specimen is mounted for examination
ili: i59440
lexfile: noun.artifact
part of speech: noun
hypernym: 03968233-n