spike-n
type: LexicalEntry
canonical form: spike
sense: 04283169-n
part of speech: noun

spindle-n
type: LexicalEntry
canonical form: spindle
sense: 04283169-n
part of speech: noun

04283169-n
type: LexicalConcept
in scheme: en-word.net
definition: any holding device consisting of a rigid, sharp-pointed object
example: the spike pierced the receipts and held them in order
ili: i59313
lexfile: noun.artifact
part of speech: noun
hypernym: 03531007-n