spectator pump-n
type: LexicalEntry
canonical form: spectator pump
sense: 04279508-n
part of speech: noun

spectator-n
type: LexicalEntry
canonical form: spectator
sense: 04279508-n
part of speech: noun

04279508-n
type: LexicalConcept
in scheme: en-word.net
definition: a woman's pump with medium heel; usually in contrasting colors for toe and heel
ili: i59286
lexfile: noun.artifact
part of speech: noun
hypernym: 04028726-n