ski binding-n
type: LexicalEntry
canonical form: ski binding
sense: 04235277-n
part of speech: noun

binding-n
type: LexicalEntry
canonical form: binding
sense: 04235277-n
part of speech: noun

04235277-n
type: LexicalConcept
in scheme: en-word.net
definition: one of a pair of mechanical devices that are attached to a ski and that will grip a ski boot; the bindings should release in case of a fall
ili: i58997
lexfile: noun.artifact
part of speech: noun
hypernym: 03742461-n