simvastatin-n
type: LexicalEntry
canonical form: simvastatin
sense: 04229061-n
part of speech: noun

Zocor-n
type: LexicalEntry
canonical form: Zocor
sense: 04229061-n
part of speech: noun

04229061-n
type: LexicalConcept
in scheme: en-word.net
definition: an oral lipid-lowering medicine (trade name Zocor) administered to reduce blood cholesterol levels; recommended after heart attacks
ili: i58957
lexfile: noun.artifact
part of speech: noun
hypernym: 03681501-n