signal box-n
type: LexicalEntry
canonical form: signal box
sense: 04224613-n
part of speech: noun

signal tower-n
type: LexicalEntry
canonical form: signal tower
sense: 04224613-n
part of speech: noun

04224613-n
type: LexicalConcept
in scheme: en-word.net
definition: a building from which signals are sent to control the movements of railway trains
ili: i58929
lexfile: noun.artifact
part of speech: noun
hypernym: 02916498-n