shelter-n
type: LexicalEntry
canonical form: shelter
sense: 04198986-n
part of speech: noun

04198986-n
type: LexicalConcept
in scheme: en-word.net
definition: protective covering that provides protection from the weather
ili: i58784
lexfile: noun.artifact
part of speech: noun
hypernym: 04020673-n