service-n
type: LexicalEntry
canonical form: service
sense: 04182441-n
part of speech: noun

table service-n
type: LexicalEntry
canonical form: table service
sense: 04182441-n
part of speech: noun

04182441-n
type: LexicalConcept
in scheme: en-word.net
definition: tableware consisting of a complete set of articles (silver or dishware) for use at table
ili: i58687
lexfile: noun.artifact
part of speech: noun
hypernym: 04389081-n