serpent-n
type: LexicalEntry
canonical form: serpent
sense: 04181657-n
part of speech: noun

04181657-n
type: LexicalConcept
in scheme: en-word.net
definition: a firework that moves in serpentine manner when ignited
ili: i58682
lexfile: noun.artifact
part of speech: noun
hypernym: 03353300-n