serpent-n
type: LexicalEntry
canonical form: serpent
sense: 04181561-n
part of speech: noun

04181561-n
type: LexicalConcept
in scheme: en-word.net
definition: an obsolete bass cornet; resembles a snake
ili: i58681
lexfile: noun.artifact
part of speech: noun
hypernym: 03115320-n