sequence-n
type: LexicalEntry
canonical form: sequence
sense: 04180233-n
part of speech: noun

episode-n
type: LexicalEntry
canonical form: episode
sense: 04180233-n
part of speech: noun

04180233-n
type: LexicalConcept
in scheme: en-word.net
definition: film consisting of a succession of related shots that develop a given subject in a movie
ili: i58672
lexfile: noun.artifact
part of speech: noun
hypernym: 03343766-n